{"text_format":"2","workbook":"xlsx","n_sheets":4,"sheets":["Vorrunde","Schützenliste-Heim","Schützenliste-Gast","Erklärung"],"not_rendered":{"charts":0,"images":0,"macros":0,"external_links":0,"defined_names":4,"comments":0,"pivot_tables":0},"unopened":[],"bounds":{"document_bytes":16777216,"sheet_cells":100000,"run_cost":"one","rows_first":2000,"rows_last":500,"rows_between":2000,"halvings":0,"cell_chars":16384,"cell_head_chars":4096},"cells_cut":0,"cells_raw":0,"read":"whole","date_system":"1900"}

{"sheet":"Vorrunde","index":0,"n_rows":56,"n_cols":15,"rows_kept":56,"cut":false,"hidden":false,"merged":[[55,0,55,14],[54,0,54,14],[6,10,6,12],[0,0,0,14],[1,0,1,14],[3,0,3,14],[9,2,9,6],[9,10,9,14]]}
["Luftgewehrwettkampf"]
["um die"]
[]
["Bezirksjugendscheibe"]
[]
[{"$nulls":4},"Ergebnis der",null,null,"Runde     ",null,null,"am"]
[null,null,"in",{"$nulls":5},"Gau"]
[]
[{"$nulls":4},"Heimmannschaft",{"$nulls":7},"Gastmannschaft"]
["Gau",{"$nulls":7},"Gau"]
[]
["Schüler ",null,"Jahrg.",{"$nulls":5},"Schüler ",null,"Jahrg."]
[]
[{"$f":"IF(ISERROR(VLOOKUP($G14,'Schützenliste-Heim'!$F$15:$I$19,4,FALSE)),\"-\",VLOOKUP($G14,'Schützenliste-Heim'!$F$15:$I$19,4,FALSE))","v":"-"},null,{"$f":"IF(ISERROR(VLOOKUP($G14,'Schützenliste-Heim'!$F$15:$I$19,3,FALSE)),\"-\",VLOOKUP($G14,'Schützenliste-Heim'!$F$15:$I$19,3,FALSE))","v":"-"},null,{"$f":"IF(ISERROR(VLOOKUP($G14,'Schützenliste-Heim'!$F$15:$I$19,2,FALSE)),\"-\",VLOOKUP($G14,'Schützenliste-Heim'!$F$15:$I$19,2,FALSE))","v":"-"},null,{"$f":"IF(ISERROR(LARGE('Schützenliste-Heim'!$F$15:$F$19,1)),\"-\",LARGE('Schützenliste-Heim'!$F$15:$F$19,1))","v":"-"},null,{"$f":"IF(ISERROR(VLOOKUP($O14,'Schützenliste-Gast'!$F$15:$I$19,4,FALSE)),\"-\",VLOOKUP($O14,'Schützenliste-Gast'!$F$15:$I$19,4,FALSE))","v":"-"},null,{"$f":"IF(ISERROR(VLOOKUP($O14,'Schützenliste-Gast'!$F$15:$I$19,3,FALSE)),\"-\",VLOOKUP($O14,'Schützenliste-Gast'!$F$15:$I$19,3,FALSE))","v":"-"},null,{"$f":"IF(ISERROR(VLOOKUP($O14,'Schützenliste-Gast'!$F$15:$I$19,2,FALSE)),\"-\",VLOOKUP($O14,'Schützenliste-Gast'!$F$15:$I$19,2,FALSE))","v":"-"},null,{"$f":"IF(ISERROR(LARGE('Schützenliste-Gast'!$F$15:$F$19,1)),\"-\",LARGE('Schützenliste-Gast'!$F$15:$F$19,1))","v":"-"}]
[{"$f":"IF(ISERROR(VLOOKUP($G15,'Schützenliste-Heim'!$F$15:$I$19,4,FALSE)),\"-\",VLOOKUP($G15,'Schützenliste-Heim'!$F$15:$I$19,4,FALSE))","v":"-"},null,{"$f":"IF(ISERROR(VLOOKUP($G15,'Schützenliste-Heim'!$F$15:$I$19,3,FALSE)),\"-\",VLOOKUP($G15,'Schützenliste-Heim'!$F$15:$I$19,3,FALSE))","v":"-"},null,{"$f":"IF(ISERROR(VLOOKUP($G15,'Schützenliste-Heim'!$F$15:$I$19,2,FALSE)),\"-\",VLOOKUP($G15,'Schützenliste-Heim'!$F$15:$I$19,2,FALSE))","v":"-"},null,{"$f":"IF(ISERROR(LARGE('Schützenliste-Heim'!$F$15:$F$19,2)),\"-\",LARGE('Schützenliste-Heim'!$F$15:$F$19,2))","v":"-"},null,{"$f":"IF(ISERROR(VLOOKUP($O15,'Schützenliste-Gast'!$F$15:$I$19,4,FALSE)),\"-\",VLOOKUP($O15,'Schützenliste-Gast'!$F$15:$I$19,4,FALSE))","v":"-"},null,{"$f":"IF(ISERROR(VLOOKUP($O15,'Schützenliste-Gast'!$F$15:$I$19,3,FALSE)),\"-\",VLOOKUP($O15,'Schützenliste-Gast'!$F$15:$I$19,3,FALSE))","v":"-"},null,{"$f":"IF(ISERROR(VLOOKUP($O15,'Schützenliste-Gast'!$F$15:$I$19,2,FALSE)),\"-\",VLOOKUP($O15,'Schützenliste-Gast'!$F$15:$I$19,2,FALSE))","v":"-"},null,{"$f":"IF(ISERROR(LARGE('Schützenliste-Gast'!$F$15:$F$19,2)),\"-\",LARGE('Schützenliste-Gast'!$F$15:$F$19,2))","v":"-"}]
[{"$f":"IF(ISERROR(VLOOKUP($G16,'Schützenliste-Heim'!$F$15:$I$19,4,FALSE)),\"-\",VLOOKUP($G16,'Schützenliste-Heim'!$F$15:$I$19,4,FALSE))","v":"-"},null,{"$f":"IF(ISERROR(VLOOKUP($G16,'Schützenliste-Heim'!$F$15:$I$19,3,FALSE)),\"-\",VLOOKUP($G16,'Schützenliste-Heim'!$F$15:$I$19,3,FALSE))","v":"-"},null,{"$f":"IF(ISERROR(VLOOKUP($G16,'Schützenliste-Heim'!$F$15:$I$19,2,FALSE)),\"-\",VLOOKUP($G16,'Schützenliste-Heim'!$F$15:$I$19,2,FALSE))","v":"-"},null,{"$f":"IF(ISERROR(LARGE('Schützenliste-Heim'!$F$15:$F$19,3)),\"-\",LARGE('Schützenliste-Heim'!$F$15:$F$19,3))","v":"-"},null,{"$f":"IF(ISERROR(VLOOKUP($O16,'Schützenliste-Gast'!$F$15:$I$19,4,FALSE)),\"-\",VLOOKUP($O16,'Schützenliste-Gast'!$F$15:$I$19,4,FALSE))","v":"-"},null,{"$f":"IF(ISERROR(VLOOKUP($O16,'Schützenliste-Gast'!$F$15:$I$19,3,FALSE)),\"-\",VLOOKUP($O16,'Schützenliste-Gast'!$F$15:$I$19,3,FALSE))","v":"-"},null,{"$f":"IF(ISERROR(VLOOKUP($O16,'Schützenliste-Gast'!$F$15:$I$19,2,FALSE)),\"-\",VLOOKUP($O16,'Schützenliste-Gast'!$F$15:$I$19,2,FALSE))","v":"-"},null,{"$f":"IF(ISERROR(LARGE('Schützenliste-Gast'!$F$15:$F$19,3)),\"-\",LARGE('Schützenliste-Gast'!$F$15:$F$19,3))","v":"-"}]
[{"$nulls":4},"Gesamt Schüler",null,{"$f":"SUM(G14:G16)","v":0},{"$nulls":5},"Gesamt Schüler",null,{"$f":"SUM(O14:O16)","v":0}]
["AK",{"$nulls":7},"AK"]
[{"$f":"IF(ISERROR(VLOOKUP($G19,'Schützenliste-Heim'!$F$15:$I$19,4,FALSE)),\"-\",VLOOKUP($G19,'Schützenliste-Heim'!$F$15:$I$19,4,FALSE))","v":"-"},null,{"$f":"IF(ISERROR(VLOOKUP($G19,'Schützenliste-Heim'!$F$15:$I$19,3,FALSE)),\"-\",VLOOKUP($G19,'Schützenliste-Heim'!$F$15:$I$19,3,FALSE))","v":"-"},null,{"$f":"IF(ISERROR(VLOOKUP($G19,'Schützenliste-Heim'!$F$15:$I$19,2,FALSE)),\"-\",VLOOKUP($G19,'Schützenliste-Heim'!$F$15:$I$19,2,FALSE))","v":"-"},null,{"$f":"IF(ISERROR(LARGE('Schützenliste-Heim'!$F$15:$F$19,4)),\"-\",LARGE('Schützenliste-Heim'!$F$15:$F$19,4))","v":"-"},null,{"$f":"IF(ISERROR(VLOOKUP($O19,'Schützenliste-Gast'!$F$15:$I$19,4,FALSE)),\"-\",VLOOKUP($O19,'Schützenliste-Gast'!$F$15:$I$19,4,FALSE))","v":"-"},null,{"$f":"IF(ISERROR(VLOOKUP($O19,'Schützenliste-Gast'!$F$15:$I$19,3,FALSE)),\"-\",VLOOKUP($O19,'Schützenliste-Gast'!$F$15:$I$19,3,FALSE))","v":"-"},null,{"$f":"IF(ISERROR(VLOOKUP($O19,'Schützenliste-Gast'!$F$15:$I$19,2,FALSE)),\"-\",VLOOKUP($O19,'Schützenliste-Gast'!$F$15:$I$19,2,FALSE))","v":"-"},null,{"$f":"IF(ISERROR(LARGE('Schützenliste-Gast'!$F$15:$F$19,4)),\"-\",LARGE('Schützenliste-Gast'!$F$15:$F$19,4))","v":"-"}]
[{"$f":"IF(ISERROR(VLOOKUP($G20,'Schützenliste-Heim'!$F$15:$I$19,4,FALSE)),\"-\",VLOOKUP($G20,'Schützenliste-Heim'!$F$15:$I$19,4,FALSE))","v":"-"},null,{"$f":"IF(ISERROR(VLOOKUP($G20,'Schützenliste-Heim'!$F$15:$I$19,3,FALSE)),\"-\",VLOOKUP($G20,'Schützenliste-Heim'!$F$15:$I$19,3,FALSE))","v":"-"},null,{"$f":"IF(ISERROR(VLOOKUP($G20,'Schützenliste-Heim'!$F$15:$I$19,2,FALSE)),\"-\",VLOOKUP($G20,'Schützenliste-Heim'!$F$15:$I$19,2,FALSE))","v":"-"},null,{"$f":"IF(ISERROR(LARGE('Schützenliste-Heim'!$F$15:$F$19,5)),\"-\",LARGE('Schützenliste-Heim'!$F$15:$F$19,5))","v":"-"},null,{"$f":"IF(ISERROR(VLOOKUP($O20,'Schützenliste-Gast'!$F$15:$I$19,4,FALSE)),\"-\",VLOOKUP($O20,'Schützenliste-Gast'!$F$15:$I$19,4,FALSE))","v":"-"},null,{"$f":"IF(ISERROR(VLOOKUP($O20,'Schützenliste-Gast'!$F$15:$I$19,3,FALSE)),\"-\",VLOOKUP($O20,'Schützenliste-Gast'!$F$15:$I$19,3,FALSE))","v":"-"},null,{"$f":"IF(ISERROR(VLOOKUP($O20,'Schützenliste-Gast'!$F$15:$I$19,2,FALSE)),\"-\",VLOOKUP($O20,'Schützenliste-Gast'!$F$15:$I$19,2,FALSE))","v":"-"},null,{"$f":"IF(ISERROR(LARGE('Schützenliste-Gast'!$F$15:$F$19,5)),\"-\",LARGE('Schützenliste-Gast'!$F$15:$F$19,5))","v":"-"}]
[]
["Jugend ",null,"Jahrg.",{"$nulls":5},"Jugend ",null,"Jahrg."]
[]
[{"$f":"IF(ISERROR(VLOOKUP($G24,'Schützenliste-Heim'!$F$24:$I$28,4,FALSE)),\"-\",VLOOKUP($G24,'Schützenliste-Heim'!$F$24:$I$28,4,FALSE))","v":"-"},null,{"$f":"IF(ISERROR(VLOOKUP($G24,'Schützenliste-Heim'!$F$24:$I$28,3,FALSE)),\"-\",VLOOKUP($G24,'Schützenliste-Heim'!$F$24:$I$28,3,FALSE))","v":"-"},null,{"$f":"IF(ISERROR(VLOOKUP($G24,'Schützenliste-Heim'!$F$24:$I$28,2,FALSE)),\"-\",VLOOKUP($G24,'Schützenliste-Heim'!$F$24:$I$28,2,FALSE))","v":"-"},null,{"$f":"IF(ISERROR(LARGE('Schützenliste-Heim'!$F$24:$F$28,1)),\"-\",LARGE('Schützenliste-Heim'!$F$24:$F$28,1))","v":"-"},null,{"$f":"IF(ISERROR(VLOOKUP($O24,'Schützenliste-Gast'!$F$24:$I$28,4,FALSE)),\"-\",VLOOKUP($O24,'Schützenliste-Gast'!$F$24:$I$28,4,FALSE))","v":"-"},null,{"$f":"IF(ISERROR(VLOOKUP($O24,'Schützenliste-Gast'!$F$24:$I$28,3,FALSE)),\"-\",VLOOKUP($O24,'Schützenliste-Gast'!$F$24:$I$28,3,FALSE))","v":"-"},null,{"$f":"IF(ISERROR(VLOOKUP($O24,'Schützenliste-Gast'!$F$24:$I$28,2,FALSE)),\"-\",VLOOKUP($O24,'Schützenliste-Gast'!$F$24:$I$28,2,FALSE))","v":"-"},null,{"$f":"IF(ISERROR(LARGE('Schützenliste-Gast'!$F$24:$F$28,1)),\"-\",LARGE('Schützenliste-Gast'!$F$24:$F$28,1))","v":"-"}]
[{"$f":"IF(ISERROR(VLOOKUP($G25,'Schützenliste-Heim'!$F$24:$I$28,4,FALSE)),\"-\",VLOOKUP($G25,'Schützenliste-Heim'!$F$24:$I$28,4,FALSE))","v":"-"},null,{"$f":"IF(ISERROR(VLOOKUP($G25,'Schützenliste-Heim'!$F$24:$I$28,3,FALSE)),\"-\",VLOOKUP($G25,'Schützenliste-Heim'!$F$24:$I$28,3,FALSE))","v":"-"},null,{"$f":"IF(ISERROR(VLOOKUP($G25,'Schützenliste-Heim'!$F$24:$I$28,2,FALSE)),\"-\",VLOOKUP($G25,'Schützenliste-Heim'!$F$24:$I$28,2,FALSE))","v":"-"},null,{"$f":"IF(ISERROR(LARGE('Schützenliste-Heim'!$F$24:$F$28,2)),\"-\",LARGE('Schützenliste-Heim'!$F$24:$F$28,2))","v":"-"},null,{"$f":"IF(ISERROR(VLOOKUP($O25,'Schützenliste-Gast'!$F$24:$I$28,4,FALSE)),\"-\",VLOOKUP($O25,'Schützenliste-Gast'!$F$24:$I$28,4,FALSE))","v":"-"},null,{"$f":"IF(ISERROR(VLOOKUP($O25,'Schützenliste-Gast'!$F$24:$I$28,3,FALSE)),\"-\",VLOOKUP($O25,'Schützenliste-Gast'!$F$24:$I$28,3,FALSE))","v":"-"},null,{"$f":"IF(ISERROR(VLOOKUP($O25,'Schützenliste-Gast'!$F$24:$I$28,2,FALSE)),\"-\",VLOOKUP($O25,'Schützenliste-Gast'!$F$24:$I$28,2,FALSE))","v":"-"},null,{"$f":"IF(ISERROR(LARGE('Schützenliste-Gast'!$F$24:$F$28,2)),\"-\",LARGE('Schützenliste-Gast'!$F$24:$F$28,2))","v":"-"}]
[{"$f":"IF(ISERROR(VLOOKUP($G26,'Schützenliste-Heim'!$F$24:$I$28,4,FALSE)),\"-\",VLOOKUP($G26,'Schützenliste-Heim'!$F$24:$I$28,4,FALSE))","v":"-"},null,{"$f":"IF(ISERROR(VLOOKUP($G26,'Schützenliste-Heim'!$F$24:$I$28,3,FALSE)),\"-\",VLOOKUP($G26,'Schützenliste-Heim'!$F$24:$I$28,3,FALSE))","v":"-"},null,{"$f":"IF(ISERROR(VLOOKUP($G26,'Schützenliste-Heim'!$F$24:$I$28,2,FALSE)),\"-\",VLOOKUP($G26,'Schützenliste-Heim'!$F$24:$I$28,2,FALSE))","v":"-"},null,{"$f":"IF(ISERROR(LARGE('Schützenliste-Heim'!$F$24:$F$28,3)),\"-\",LARGE('Schützenliste-Heim'!$F$24:$F$28,3))","v":"-"},null,{"$f":"IF(ISERROR(VLOOKUP($O26,'Schützenliste-Gast'!$F$24:$I$28,4,FALSE)),\"-\",VLOOKUP($O26,'Schützenliste-Gast'!$F$24:$I$28,4,FALSE))","v":"-"},null,{"$f":"IF(ISERROR(VLOOKUP($O26,'Schützenliste-Gast'!$F$24:$I$28,3,FALSE)),\"-\",VLOOKUP($O26,'Schützenliste-Gast'!$F$24:$I$28,3,FALSE))","v":"-"},null,{"$f":"IF(ISERROR(VLOOKUP($O26,'Schützenliste-Gast'!$F$24:$I$28,2,FALSE)),\"-\",VLOOKUP($O26,'Schützenliste-Gast'!$F$24:$I$28,2,FALSE))","v":"-"},null,{"$f":"IF(ISERROR(LARGE('Schützenliste-Gast'!$F$24:$F$28,3)),\"-\",LARGE('Schützenliste-Gast'!$F$24:$F$28,3))","v":"-"}]
[{"$nulls":4},"Gesamt Jugend",null,{"$f":"SUM(G24:G26)","v":0},{"$nulls":5},"Gesamt Jugend",null,{"$f":"SUM(O24:O26)","v":0}]
["AK",{"$nulls":7},"AK"]
[{"$f":"IF(ISERROR(VLOOKUP($G29,'Schützenliste-Heim'!$F$24:$I$28,4,FALSE)),\"-\",VLOOKUP($G29,'Schützenliste-Heim'!$F$24:$I$28,4,FALSE))","v":"-"},null,{"$f":"IF(ISERROR(VLOOKUP($G29,'Schützenliste-Heim'!$F$24:$I$28,3,FALSE)),\"-\",VLOOKUP($G29,'Schützenliste-Heim'!$F$24:$I$28,3,FALSE))","v":"-"},null,{"$f":"IF(ISERROR(VLOOKUP($G29,'Schützenliste-Heim'!$F$24:$I$28,2,FALSE)),\"-\",VLOOKUP($G29,'Schützenliste-Heim'!$F$24:$I$28,2,FALSE))","v":"-"},null,{"$f":"IF(ISERROR(LARGE('Schützenliste-Heim'!$F$24:$F$28,4)),\"-\",LARGE('Schützenliste-Heim'!$F$24:$F$28,4))","v":"-"},null,{"$f":"IF(ISERROR(VLOOKUP($O29,'Schützenliste-Gast'!$F$24:$I$28,4,FALSE)),\"-\",VLOOKUP($O29,'Schützenliste-Gast'!$F$24:$I$28,4,FALSE))","v":"-"},null,{"$f":"IF(ISERROR(VLOOKUP($O29,'Schützenliste-Gast'!$F$24:$I$28,3,FALSE)),\"-\",VLOOKUP($O29,'Schützenliste-Gast'!$F$24:$I$28,3,FALSE))","v":"-"},null,{"$f":"IF(ISERROR(VLOOKUP($O29,'Schützenliste-Gast'!$F$24:$I$28,2,FALSE)),\"-\",VLOOKUP($O29,'Schützenliste-Gast'!$F$24:$I$28,2,FALSE))","v":"-"},null,{"$f":"IF(ISERROR(LARGE('Schützenliste-Gast'!$F$24:$F$28,4)),\"-\",LARGE('Schützenliste-Gast'!$F$24:$F$28,4))","v":"-"}]
[{"$f":"IF(ISERROR(VLOOKUP($G30,'Schützenliste-Heim'!$F$24:$I$28,4,FALSE)),\"-\",VLOOKUP($G30,'Schützenliste-Heim'!$F$24:$I$28,4,FALSE))","v":"-"},null,{"$f":"IF(ISERROR(VLOOKUP($G30,'Schützenliste-Heim'!$F$24:$I$28,3,FALSE)),\"-\",VLOOKUP($G30,'Schützenliste-Heim'!$F$24:$I$28,3,FALSE))","v":"-"},null,{"$f":"IF(ISERROR(VLOOKUP($G30,'Schützenliste-Heim'!$F$24:$I$28,2,FALSE)),\"-\",VLOOKUP($G30,'Schützenliste-Heim'!$F$24:$I$28,2,FALSE))","v":"-"},null,{"$f":"IF(ISERROR(LARGE('Schützenliste-Heim'!$F$24:$F$28,5)),\"-\",LARGE('Schützenliste-Heim'!$F$24:$F$28,5))","v":"-"},null,{"$f":"IF(ISERROR(VLOOKUP($O30,'Schützenliste-Gast'!$F$24:$I$28,4,FALSE)),\"-\",VLOOKUP($O30,'Schützenliste-Gast'!$F$24:$I$28,4,FALSE))","v":"-"},null,{"$f":"IF(ISERROR(VLOOKUP($O30,'Schützenliste-Gast'!$F$24:$I$28,3,FALSE)),\"-\",VLOOKUP($O30,'Schützenliste-Gast'!$F$24:$I$28,3,FALSE))","v":"-"},null,{"$f":"IF(ISERROR(VLOOKUP($O30,'Schützenliste-Gast'!$F$24:$I$28,2,FALSE)),\"-\",VLOOKUP($O30,'Schützenliste-Gast'!$F$24:$I$28,2,FALSE))","v":"-"},null,{"$f":"IF(ISERROR(LARGE('Schützenliste-Gast'!$F$24:$F$28,5)),\"-\",LARGE('Schützenliste-Gast'!$F$24:$F$28,5))","v":"-"}]
[]
["Junioren II",null,"Jahrg.",{"$nulls":5},"Junioren II",0,"Jahrg."]
[]
[{"$f":"IF(ISERROR(VLOOKUP($G34,'Schützenliste-Heim'!$F$33:$I$37,4,FALSE)),\"-\",VLOOKUP($G34,'Schützenliste-Heim'!$F$33:$I$37,4,FALSE))","v":"-"},null,{"$f":"IF(ISERROR(VLOOKUP($G34,'Schützenliste-Heim'!$F$33:$I$37,3,FALSE)),\"-\",VLOOKUP($G34,'Schützenliste-Heim'!$F$33:$I$37,3,FALSE))","v":"-"},null,{"$f":"IF(ISERROR(VLOOKUP($G34,'Schützenliste-Heim'!$F$33:$I$37,2,FALSE)),\"-\",VLOOKUP($G34,'Schützenliste-Heim'!$F$33:$I$37,2,FALSE))","v":"-"},null,{"$f":"IF(ISERROR(LARGE('Schützenliste-Heim'!$F$33:$F$37,1)),\"-\",LARGE('Schützenliste-Heim'!$F$33:$F$37,1))","v":"-"},null,{"$f":"IF(ISERROR(VLOOKUP($O34,'Schützenliste-Gast'!$F$33:$I$37,4,FALSE)),\"-\",VLOOKUP($O34,'Schützenliste-Gast'!$F$33:$I$37,4,FALSE))","v":"-"},null,{"$f":"IF(ISERROR(VLOOKUP($O34,'Schützenliste-Gast'!$F$33:$I$37,3,FALSE)),\"-\",VLOOKUP($O34,'Schützenliste-Gast'!$F$33:$I$37,3,FALSE))","v":"-"},null,{"$f":"IF(ISERROR(VLOOKUP($O34,'Schützenliste-Gast'!$F$33:$I$37,2,FALSE)),\"-\",VLOOKUP($O34,'Schützenliste-Gast'!$F$33:$I$37,2,FALSE))","v":"-"},null,{"$f":"IF(ISERROR(LARGE('Schützenliste-Gast'!$F$33:$F$37,1)),\"-\",LARGE('Schützenliste-Gast'!$F$33:$F$37,1))","v":"-"}]
[{"$f":"IF(ISERROR(VLOOKUP($G35,'Schützenliste-Heim'!$F$33:$I$37,4,FALSE)),\"-\",VLOOKUP($G35,'Schützenliste-Heim'!$F$33:$I$37,4,FALSE))","v":"-"},null,{"$f":"IF(ISERROR(VLOOKUP($G35,'Schützenliste-Heim'!$F$33:$I$37,3,FALSE)),\"-\",VLOOKUP($G35,'Schützenliste-Heim'!$F$33:$I$37,3,FALSE))","v":"-"},null,{"$f":"IF(ISERROR(VLOOKUP($G35,'Schützenliste-Heim'!$F$33:$I$37,2,FALSE)),\"-\",VLOOKUP($G35,'Schützenliste-Heim'!$F$33:$I$37,2,FALSE))","v":"-"},null,{"$f":"IF(ISERROR(LARGE('Schützenliste-Heim'!$F$33:$F$37,2)),\"-\",LARGE('Schützenliste-Heim'!$F$33:$F$37,2))","v":"-"},null,{"$f":"IF(ISERROR(VLOOKUP($O35,'Schützenliste-Gast'!$F$33:$I$37,4,FALSE)),\"-\",VLOOKUP($O35,'Schützenliste-Gast'!$F$33:$I$37,4,FALSE))","v":"-"},null,{"$f":"IF(ISERROR(VLOOKUP($O35,'Schützenliste-Gast'!$F$33:$I$37,3,FALSE)),\"-\",VLOOKUP($O35,'Schützenliste-Gast'!$F$33:$I$37,3,FALSE))","v":"-"},null,{"$f":"IF(ISERROR(VLOOKUP($O35,'Schützenliste-Gast'!$F$33:$I$37,2,FALSE)),\"-\",VLOOKUP($O35,'Schützenliste-Gast'!$F$33:$I$37,2,FALSE))","v":"-"},null,{"$f":"IF(ISERROR(LARGE('Schützenliste-Gast'!$F$33:$F$37,2)),\"-\",LARGE('Schützenliste-Gast'!$F$33:$F$37,2))","v":"-"}]
[{"$f":"IF(ISERROR(VLOOKUP($G36,'Schützenliste-Heim'!$F$33:$I$37,4,FALSE)),\"-\",VLOOKUP($G36,'Schützenliste-Heim'!$F$33:$I$37,4,FALSE))","v":"-"},null,{"$f":"IF(ISERROR(VLOOKUP($G36,'Schützenliste-Heim'!$F$33:$I$37,3,FALSE)),\"-\",VLOOKUP($G36,'Schützenliste-Heim'!$F$33:$I$37,3,FALSE))","v":"-"},null,{"$f":"IF(ISERROR(VLOOKUP($G36,'Schützenliste-Heim'!$F$33:$I$37,2,FALSE)),\"-\",VLOOKUP($G36,'Schützenliste-Heim'!$F$33:$I$37,2,FALSE))","v":"-"},null,{"$f":"IF(ISERROR(LARGE('Schützenliste-Heim'!$F$33:$F$37,3)),\"-\",LARGE('Schützenliste-Heim'!$F$33:$F$37,3))","v":"-"},null,{"$f":"IF(ISERROR(VLOOKUP($O36,'Schützenliste-Gast'!$F$33:$I$37,4,FALSE)),\"-\",VLOOKUP($O36,'Schützenliste-Gast'!$F$33:$I$37,4,FALSE))","v":"-"},null,{"$f":"IF(ISERROR(VLOOKUP($O36,'Schützenliste-Gast'!$F$33:$I$37,3,FALSE)),\"-\",VLOOKUP($O36,'Schützenliste-Gast'!$F$33:$I$37,3,FALSE))","v":"-"},null,{"$f":"IF(ISERROR(VLOOKUP($O36,'Schützenliste-Gast'!$F$33:$I$37,2,FALSE)),\"-\",VLOOKUP($O36,'Schützenliste-Gast'!$F$33:$I$37,2,FALSE))","v":"-"},null,{"$f":"IF(ISERROR(LARGE('Schützenliste-Gast'!$F$33:$F$37,3)),\"-\",LARGE('Schützenliste-Gast'!$F$33:$F$37,3))","v":"-"}]
[{"$nulls":4},"Gesamt Junioren II",null,{"$f":"SUM(G34:G36)","v":0},{"$nulls":5},"Gesamt Junioren II",null,{"$f":"SUM(O34:O36)","v":0}]
["AK",{"$nulls":7},"AK"]
[{"$f":"IF(ISERROR(VLOOKUP($G39,'Schützenliste-Heim'!$F$33:$I$37,4,FALSE)),\"-\",VLOOKUP($G39,'Schützenliste-Heim'!$F$33:$I$37,4,FALSE))","v":"-"},null,{"$f":"IF(ISERROR(VLOOKUP($G39,'Schützenliste-Heim'!$F$33:$I$37,3,FALSE)),\"-\",VLOOKUP($G39,'Schützenliste-Heim'!$F$33:$I$37,3,FALSE))","v":"-"},null,{"$f":"IF(ISERROR(VLOOKUP($G39,'Schützenliste-Heim'!$F$33:$I$37,2,FALSE)),\"-\",VLOOKUP($G39,'Schützenliste-Heim'!$F$33:$I$37,2,FALSE))","v":"-"},null,{"$f":"IF(ISERROR(LARGE('Schützenliste-Heim'!$F$33:$F$37,4)),\"-\",LARGE('Schützenliste-Heim'!$F$33:$F$37,4))","v":"-"},null,{"$f":"IF(ISERROR(VLOOKUP($O39,'Schützenliste-Gast'!$F$33:$I$37,4,FALSE)),\"-\",VLOOKUP($O39,'Schützenliste-Gast'!$F$33:$I$37,4,FALSE))","v":"-"},null,{"$f":"IF(ISERROR(VLOOKUP($O39,'Schützenliste-Gast'!$F$33:$I$37,3,FALSE)),\"-\",VLOOKUP($O39,'Schützenliste-Gast'!$F$33:$I$37,3,FALSE))","v":"-"},null,{"$f":"IF(ISERROR(VLOOKUP($O39,'Schützenliste-Gast'!$F$33:$I$37,2,FALSE)),\"-\",VLOOKUP($O39,'Schützenliste-Gast'!$F$33:$I$37,2,FALSE))","v":"-"},null,{"$f":"IF(ISERROR(LARGE('Schützenliste-Gast'!$F$33:$F$37,4)),\"-\",LARGE('Schützenliste-Gast'!$F$33:$F$37,4))","v":"-"}]
[{"$f":"IF(ISERROR(VLOOKUP($G40,'Schützenliste-Heim'!$F$33:$I$37,4,FALSE)),\"-\",VLOOKUP($G40,'Schützenliste-Heim'!$F$33:$I$37,4,FALSE))","v":"-"},null,{"$f":"IF(ISERROR(VLOOKUP($G40,'Schützenliste-Heim'!$F$33:$I$37,3,FALSE)),\"-\",VLOOKUP($G40,'Schützenliste-Heim'!$F$33:$I$37,3,FALSE))","v":"-"},null,{"$f":"IF(ISERROR(VLOOKUP($G40,'Schützenliste-Heim'!$F$33:$I$37,2,FALSE)),\"-\",VLOOKUP($G40,'Schützenliste-Heim'!$F$33:$I$37,2,FALSE))","v":"-"},null,{"$f":"IF(ISERROR(LARGE('Schützenliste-Heim'!$F$33:$F$37,5)),\"-\",LARGE('Schützenliste-Heim'!$F$33:$F$37,5))","v":"-"},null,{"$f":"IF(ISERROR(VLOOKUP($O40,'Schützenliste-Gast'!$F$33:$I$37,4,FALSE)),\"-\",VLOOKUP($O40,'Schützenliste-Gast'!$F$33:$I$37,4,FALSE))","v":"-"},null,{"$f":"IF(ISERROR(VLOOKUP($O40,'Schützenliste-Gast'!$F$33:$I$37,3,FALSE)),\"-\",VLOOKUP($O40,'Schützenliste-Gast'!$F$33:$I$37,3,FALSE))","v":"-"},null,{"$f":"IF(ISERROR(VLOOKUP($O40,'Schützenliste-Gast'!$F$33:$I$37,2,FALSE)),\"-\",VLOOKUP($O40,'Schützenliste-Gast'!$F$33:$I$37,2,FALSE))","v":"-"},null,{"$f":"IF(ISERROR(LARGE('Schützenliste-Gast'!$F$33:$F$37,5)),\"-\",LARGE('Schützenliste-Gast'!$F$33:$F$37,5))","v":"-"}]
{"$rows_left_out":17}
{"sheet":"Schützenliste-Heim","index":1,"n_rows":50,"n_cols":9,"rows_kept":50,"cut":false,"hidden":false,"merged":[[2,1,2,6],[4,3,4,5],[47,2,47,4]]}
[]
[]
[null,"Schützenliste Heim"]
[]
[null,null,"Schützengau:",{"$nulls":4},"Sportjahr:",2025]
[]
[]
[]
[]
[null,null,"Wertungschützen","(5 Schützen, die besten 3 werden gewertet)"]
[]
[null,null,"Schüler",{"$f":"I5-14","v":2011},"und jünger"]
[]
[null,null,"Vorname & Nachname","Geburtsjahr","Passnummer","Ergebnis"]
[null,"1.",{"$nulls":4},{"$f":"C15","v":0},0,0]
[null,"2.",{"$nulls":4},0,0,0]
[null,"3.",{"$nulls":4},0,0,0]
[null,"4.",{"$nulls":4},0,0,0]
[null,"5.",{"$nulls":4},0,0,0]
[]
[null,null,"Jugend",{"$f":"I5-16","v":2009},{"$f":"I5-15","v":2010}]
[]
[null,null,"Vorname & Nachname","Geburtsjahr","Passnummer","Ergebnis"]
[null,"1.",{"$nulls":4},{"$f":"C24","v":0},0,0]
[null,"2.",{"$nulls":4},0,0,0]
[null,"3.",{"$nulls":4},0,0,0]
[null,"4.",{"$nulls":4},0,0,0]
[null,"5.",{"$nulls":4},0,0,0]
[]
[null,null,"Junioren II",{"$f":"I5-18","v":2007},{"$f":"I5-17","v":2008}]
[]
[null,null,"Vorname & Nachname","Geburtsjahr","Passnummer","Ergebnis"]
[null,"1.",{"$nulls":4},{"$f":"C33","v":0},0,0]
[null,"2.",{"$nulls":4},0,0,0]
[null,"3.",{"$nulls":4},0,0,0]
[null,"4.",{"$nulls":4},0,0,0]
[null,"5.",{"$nulls":4},0,0,0]
[]
[null,null,"Junioren I",{"$f":"I5-20","v":2005},{"$f":"I5-19","v":2006}]
[]
{"$rows_left_out":11}
{"sheet":"Schützenliste-Gast","index":2,"n_rows":50,"n_cols":9,"rows_kept":50,"cut":false,"hidden":false,"merged":[[2,1,2,6],[4,3,4,5],[47,2,47,4]]}
[]
[]
[null,"Schützenliste Gast"]
[]
[null,null,"Schützengau:",{"$nulls":4},"Sportjahr:",2025]
[]
[]
[]
[]
[null,null,"Wertungschützen","(5 Schützen, die besten 3 werden gewertet)"]
[]
[null,null,"Schüler",{"$f":"I5-14","v":2011},"und jünger"]
[]
[null,null,"Vorname & Nachname","Geburtsjahr","Passnummer","Ergebnis"]
[null,"1.",{"$nulls":4},{"$f":"C15","v":0},0,0]
[null,"2.",{"$nulls":4},0,0,0]
[null,"3.",{"$nulls":4},0,0,0]
[null,"4.",{"$nulls":4},0,0,0]
[null,"5.",{"$nulls":4},0,0,0]
[]
[null,null,"Jugend",{"$f":"I5-16","v":2009},{"$f":"I5-15","v":2010}]
[]
[null,null,"Vorname & Nachname","Geburtsjahr","Passnummer","Ergebnis"]
[null,"1.",{"$nulls":4},{"$f":"C24","v":0},0,0]
[null,"2.",{"$nulls":4},0,0,0]
[null,"3.",{"$nulls":4},0,0,0]
[null,"4.",{"$nulls":4},0,0,0]
[null,"5.",{"$nulls":4},0,0,0]
[]
[null,null,"Junioren II",{"$f":"I5-18","v":2007},{"$f":"I5-17","v":2008}]
[]
[null,null,"Vorname & Nachname","Geburtsjahr","Passnummer","Ergebnis"]
[null,"1.",{"$nulls":4},{"$f":"C33","v":0},0,0]
[null,"2.",{"$nulls":4},0,0,0]
[null,"3.",{"$nulls":4},0,0,0]
[null,"4.",{"$nulls":4},0,0,0]
[null,"5.",{"$nulls":4},0,0,0]
[]
[null,null,"Junioren I",{"$f":"I5-20","v":2005},{"$f":"I5-19","v":2006}]
[]
{"$rows_left_out":11}
{"sheet":"Erklärung","index":3,"n_rows":7,"n_cols":2,"rows_kept":7,"cut":false,"hidden":false,"merged":[]}
[]
[]
[null,"Erklärung zum Ausfüllen"]
[]
[null,"Es sind grundsätzlich nur die weiß hinterlegten Felder auf den Seiten 2 und 3 auszufüllen."]
[null,"Auf Seite 1 muss der Kopf ausgefüllt werden, alle anderen Felder füllen sich automatisch"]
[null,"mit den Daten aus Seite 2 und 3."]